error compilando Cryptkeeper

Dudas al crear un paquete? cualquier problema que tengas con makepkg comentalo aca!
Responder
Avatar de Usuario
keopety
Archer Intermedio
Archer Intermedio
Mensajes: 96
Registrado: 06 Mar 2012, 07:59
Ubicación: Al final de la cueva y sin mechero

error compilando Cryptkeeper

Mensaje por keopety » 21 Abr 2012, 12:47

pues que me dispongo a instalar Cryptkeeper y desde yaourt me sale este error, pero haciendolo a mano con el pkgbuild tambien me sele el error y no lo compila, sabe alguien como solucionarlo?
error:

Código: Seleccionar todo

lsof.cpp: En la función ‘void get_fsusers(lsof_result_t*, const char*)’:
lsof.cpp:40:2: error: ‘pipe’ no se declaró en este ámbito
lsof.cpp:42:17: error: ‘fork’ no se declaró en este ámbito
lsof.cpp:44:15: error: ‘dup2’ no se declaró en este ámbito
lsof.cpp:45:14: error: ‘close’ no se declaró en este ámbito
lsof.cpp:46:44: error: ‘execlp’ no se declaró en este ámbito
lsof.cpp:49:13: error: ‘close’ no se declaró en este ámbito
lsof.cpp:56:29: aviso: se descarta el valor de devolución de ‘char* fgets(char*, int, FILE*)’, se declaró con el atributo warn_unused_result [-Wunused-result]
make[2]: *** [lsof.o] Error 1
make[2]: se sale del directorio `/tmp/yaourt-tmp-keops/aur-cryptkeeper/src/cryptkeeper-0.9.5/src'
make[1]: *** [all-recursive] Error 1
make[1]: se sale del directorio `/tmp/yaourt-tmp-keops/aur-cryptkeeper/src/cryptkeeper-0.9.5'
make: *** [all] Error 2
un saludo
Imagen
Distro Actual: ArchLinux x86_64 KDE

Todos somos muy ignorantes. Lo que ocurre es que no todos ignoramos las mismas cosas.
(Albert Einstein)

Responder