error al compilar firefox...Out of memory: Kill process 6763

Dudas al crear un paquete? cualquier problema que tengas con makepkg comentalo aca!
Cerrado
papu
Archer
Archer
Mensajes: 20
Registrado: 30 Oct 2011, 12:22

error al compilar firefox...Out of memory: Kill process 6763

Mensaje por papu » 13 Oct 2012, 06:52

pues eso llevo intentanco compilar el firefox tanto version 15 como la nueva y siempre me sale el mismo error, que creo me deja sin ram y eso que tengo 8 gigas, probe meter 8 gigas de swap pero hace exactamente lo mismo, aqui estan todos los datos al respecto para que los consultéis, lo único no he probado es cambiar la versión del compilador , ¿que opináis? esta claro es un error de linkage donde el sistema se colapsa al quedarse sin memoria fisica...estas cosas no me ocurrían en gentoo jjaja y compilando paquetes mayores con menos ram :mrgreen:
ERROR con yaourt -Sb o makepkg -s:
/tmp/yaourt-tmp-enric/abs-firefox/src/mozilla-release/obj-x86_64-unknown-linux-gnu/toolkit/library/nsUnicharUtils.cpp:275:1: warning: always_inline function might not be inlinable [-Wattributes]
/tmp/yaourt-tmp-enric/abs-firefox/src/mozilla-release/obj-x86_64-unknown-linux-gnu/toolkit/library/nsUnicharUtils.cpp:50:1: warning: always_inline function might not be inlinable [-Wattributes]
/tmp/yaourt-tmp-enric/abs-firefox/src/mozilla-release/obj-x86_64-unknown-linux-gnu/toolkit/library/nsUnicharUtils.cpp:40:1: warning: always_inline function might not be inlinable [-Wattributes]
rm -f libxul.so
/tmp/yaourt-tmp-enric/abs-firefox/src/mozilla-release/obj-x86_64-unknown-linux-gnu/_virtualenv/bin/python /tmp/yaourt-tmp-enric/abs-firefox/src/mozilla-release/config/pythonpath.py -I../../config /tmp/yaourt-tmp-enric/abs-firefox/src/mozilla-release/config/expandlibs_exec.py --depend .deps/libxul.so.pp --target libxul.so --uselist -- c++ -pedantic -Wall -Wpointer-arith -Woverloaded-virtual -Werror=return-type -Wtype-limits -Wempty-body -Wno-ctor-dtor-privacy -Wno-overlength-strings -Wno-invalid-offsetof -Wno-variadic-macros -Wcast-align -Wno-long-long -march=native -O2 -pipe -fstack-protector --param=ssp-buffer-size=4 -D_FORTIFY_SOURCE=2 -fno-exceptions -fno-strict-aliasing -fno-rtti -ffunction-sections -fdata-sections -fno-exceptions -std=gnu++0x -pthread -pipe -DNDEBUG -DTRIMMED -g -fprofile-generate -O3 -fomit-frame-pointer -fPIC -shared -Wl,-z,defs -Wl,--gc-sections -Wl,-h,libxul.so -o libxul.so nsStaticXULComponents.i_o nsUnicharUtils.i_o nsBidiUtils.i_o nsSpecialCasingData.i_o nsUnicodeProperties.i_o nsRDFResource.i_o -lpthread -Wl,-O1,--sort-common,--as-needed,-z,relro -Wl,-rpath,/usr/lib/firefox -Wl,-z,noexecstack -fprofile-generate -Wl,-rpath-link,/tmp/yaourt-tmp-enric/abs-firefox/src/mozilla-release/obj-x86_64-unknown-linux-gnu/dist/bin -Wl,-rpath-link,/usr/lib ../../toolkit/xre/libxulapp_s.a ../../staticlib/components/libnecko.a ../../staticlib/components/libuconv.a ../../staticlib/components/libi18n.a ../../staticlib/components/libchardet.a ../../staticlib/components/libjar50.a ../../staticlib/components/libstartupcache.a ../../staticlib/components/libpref.a ../../staticlib/components/libhtmlpars.a ../../staticlib/components/libidentity.a ../../staticlib/components/libimglib2.a ../../staticlib/components/libgkgfx.a ../../staticlib/components/libgklayout.a ../../staticlib/components/libdocshell.a ../../staticlib/components/libembedcomponents.a ../../staticlib/components/libwebbrwsr.a ../../staticlib/components/libnsappshell.a ../../staticlib/components/libtxmgr.a ../../staticlib/components/libcommandlines.a ../../staticlib/components/libtoolkitcomps.a ../../staticlib/components/libpipboot.a ../../staticlib/components/libpipnss.a ../../staticlib/components/libappcomps.a ../../staticlib/components/libjsreflect.a ../../staticlib/components/libcomposer.a ../../staticlib/components/libtelemetry.a ../../staticlib/components/libjsinspector.a ../../staticlib/components/libjsdebugger.a ../../staticlib/components/libstoragecomps.a ../../staticlib/components/librdf.a ../../staticlib/components/libwindowds.a ../../staticlib/components/libjsctypes.a ../../staticlib/components/libjsperf.a ../../staticlib/components/libgkplugin.a ../../staticlib/components/libunixproxy.a ../../staticlib/components/libjsd.a ../../staticlib/components/libautoconfig.a ../../staticlib/components/libauth.a ../../staticlib/components/libcookie.a ../../staticlib/components/libpermissions.a ../../staticlib/components/libuniversalchardet.a ../../staticlib/components/libfileview.a ../../staticlib/components/libplaces.a ../../staticlib/components/libtkautocomplete.a ../../staticlib/components/libsatchel.a ../../staticlib/components/libpippki.a ../../staticlib/components/libwidget_gtk2.a ../../staticlib/components/libimgicon.a ../../staticlib/components/libprofiler.a ../../staticlib/components/libaccessibility.a ../../staticlib/components/libremoteservice.a ../../staticlib/components/libspellchecker.a ../../staticlib/components/libzipwriter.a ../../staticlib/components/libservices-crypto.a ../../staticlib/libjsipc_s.a ../../staticlib/libdomipc_s.a ../../staticlib/libdomplugins_s.a ../../staticlib/libmozipc_s.a ../../staticlib/libmozipdlgen_s.a ../../staticlib/libipcshell_s.a ../../staticlib/libgfxipc_s.a ../../staticlib/libhal_s.a ../../staticlib/libdombindings_s.a ../../staticlib/libxpcom_core.a ../../staticlib/libucvutil_s.a ../../staticlib/libchromium_s.a ../../staticlib/libsnappy_s.a ../../staticlib/libgtkxtbin.a ../../staticlib/libthebes.a ../../staticlib/libgl.a ../../staticlib/libycbcr.a -L../../dist/bin -L../../dist/lib /tmp/yaourt-tmp-enric/abs-firefox/src/mozilla-release/obj-x86_64-unknown-linux-gnu/dist/lib/libjs_static.a -lffi -Wl,-rpath-link,/usr/lib -L/usr/lib -lssl3 -lsmime3 -lnss3 -lnssutil3 -lcrmf -lXrender -lfreetype -lfontconfig -lsqlite3 -ljpeg -lpng -lz -lhunspell-1.3 -L/usr/lib -levent -lpixman-1 ../../dist/lib/libgkmedias.a -lasound -lrt -L../../dist/bin -L../../dist/lib -L/usr/lib -lplds4 -lplc4 -lnspr4 -lpthread -ldl ../../dist/lib/libmozalloc.a -ldbus-glib-1 -ldbus-1 -lgobject-2.0 -lglib-2.0 -lX11 -lXext -lpangoft2-1.0 -lfreetype -lfontconfig -lpangocairo-1.0 -lpango-1.0 -lcairo -lgobject-2.0 -lglib-2.0 -lgtk-x11-2.0 -latk-1.0 -lgio-2.0 -lpangoft2-1.0 -lfreetype -lfontconfig -lgdk-x11-2.0 -lpangocairo-1.0 -lgdk_pixbuf-2.0 -lpango-1.0 -lcairo -lgobject-2.0 -lglib-2.0 -lXt -lgthread-2.0 -lfreetype -lstartup-notification-1 -lvpx -ldl -lrt -lrt
collect2: error: ld terminated with signal 9 [Matat]
make[6]: *** [libxul.so] Error 1
make[6]: Leaving directory `/tmp/yaourt-tmp-enric/abs-firefox/src/mozilla-release/obj-x86_64-unknown-linux-gnu/toolkit/library'
make[5]: *** [libs_tier_platform] Error 2
make[5]: Leaving directory `/tmp/yaourt-tmp-enric/abs-firefox/src/mozilla-release/obj-x86_64-unknown-linux-gnu'
make[4]: *** [tier_platform] Error 2
make[4]: Leaving directory `/tmp/yaourt-tmp-enric/abs-firefox/src/mozilla-release/obj-x86_64-unknown-linux-gnu'
make[3]: *** [default] Error 2
make[3]: Leaving directory `/tmp/yaourt-tmp-enric/abs-firefox/src/mozilla-release/obj-x86_64-unknown-linux-gnu'
make[2]: *** [realbuild] Error 2
make[2]: Leaving directory `/tmp/yaourt-tmp-enric/abs-firefox/src/mozilla-release'
make[1]: *** [profiledbuild] Error 2
make[1]: Leaving directory `/tmp/yaourt-tmp-enric/abs-firefox/src/mozilla-release'
make: *** [build] Error 2


Salida dmesg cuando empieza el ld supongo para enlazar que es donde se cosca:
[ 1521.353469] ld invoked oom-killer: gfp_mask=0x280da, order=0, oom_adj=0, oom_score_adj=0
[ 1521.353474] Pid: 6763, comm: ld Not tainted 3.6.0 #1
[ 1521.353475] Call Trace:
[ 1521.353482] [<ffffffff814cc68e>] ? dump_header.isra.11+0x5d/0x18e
[ 1521.353486] [<ffffffff812ae3dc>] ? ___ratelimit+0xac/0x120
[ 1521.353489] [<ffffffff810e2fb5>] ? oom_kill_process+0x275/0x3b0
[ 1521.353492] [<ffffffff810e2b10>] ? find_lock_task_mm+0x20/0x70
[ 1521.353494] [<ffffffff810e3455>] ? out_of_memory+0x1c5/0x290
[ 1521.353497] [<ffffffff810e742a>] ? __alloc_pages_nodemask+0x85a/0x870
[ 1521.353500] [<ffffffff811048c4>] ? handle_pte_fault+0x8c4/0xb10
[ 1521.353505] [<ffffffff81075ddf>] ? select_task_rq_fair+0x4cf/0x790
[ 1521.353509] [<ffffffff8100a21f>] ? native_sched_clock+0xf/0x70
[ 1521.353512] [<ffffffff8102b880>] ? do_page_fault+0x130/0x460
[ 1521.353515] [<ffffffff810e6301>] ? get_page_from_freelist+0x311/0x670
[ 1521.353519] [<ffffffff814d2275>] ? page_fault+0x25/0x30
[ 1521.353523] [<ffffffff810df577>] ? file_read_actor+0x67/0x1f0
[ 1521.353526] [<ffffffff810f6915>] ? shmem_file_aio_read+0x155/0x3a0
[ 1521.353530] [<ffffffff81128832>] ? do_sync_read+0x92/0xd0
[ 1521.353532] [<ffffffff811290c0>] ? vfs_read+0xa0/0x160
[ 1521.353535] [<ffffffff811291c7>] ? sys_read+0x47/0xa0
[ 1521.353537] [<ffffffff814d2275>] ? page_fault+0x25/0x30
[ 1521.353540] [<ffffffff814d27fd>] ? system_call_fastpath+0x1a/0x1f
[ 1521.353541] Mem-Info:
[ 1521.353543] DMA per-cpu:
[ 1521.353544] CPU 0: hi: 0, btch: 1 usd: 0
[ 1521.353545] CPU 1: hi: 0, btch: 1 usd: 0
[ 1521.353546] CPU 2: hi: 0, btch: 1 usd: 0
[ 1521.353547] CPU 3: hi: 0, btch: 1 usd: 0
[ 1521.353548] DMA32 per-cpu:
[ 1521.353550] CPU 0: hi: 186, btch: 31 usd: 0
[ 1521.353551] CPU 1: hi: 186, btch: 31 usd: 26
[ 1521.353552] CPU 2: hi: 186, btch: 31 usd: 59
[ 1521.353553] CPU 3: hi: 186, btch: 31 usd: 0
[ 1521.353554] Normal per-cpu:
[ 1521.353555] CPU 0: hi: 186, btch: 31 usd: 30
[ 1521.353556] CPU 1: hi: 186, btch: 31 usd: 156
[ 1521.353557] CPU 2: hi: 186, btch: 31 usd: 169
[ 1521.353558] CPU 3: hi: 186, btch: 31 usd: 0
[ 1521.353562] active_anon:1599337 inactive_anon:345122 isolated_anon:0
active_file:140 inactive_file:222 isolated_file:0
unevictable:17 dirty:0 writeback:0 unstable:0
free:11562 slab_reclaimable:14927 slab_unreclaimable:21150
mapped:6681 shmem:932329 pagetables:10868 bounce:0
[ 1521.353567] DMA free:15892kB min:20kB low:24kB high:28kB active_anon:0kB inactive_anon:0kB active_file:0kB inactive_file:0kB unevictable:0kB isolated(anon):0kB isolated(file):0kB present:15644kB mlocked:0kB dirty:0kB writeback:0kB mapped:0kB shmem:0kB slab_reclaimable:0kB slab_unreclaimable:8kB kernel_stack:0kB pagetables:0kB unstable:0kB bounce:0kB writeback_tmp:0kB pages_scanned:0 all_unreclaimable? yes
[ 1521.353568] lowmem_reserve[]: 0 3147 7925 7925
[ 1521.353575] DMA32 free:23592kB min:4520kB low:5648kB high:6780kB active_anon:2754024kB inactive_anon:412764kB active_file:16kB inactive_file:44kB unevictable:0kB isolated(anon):0kB isolated(file):0kB present:3223060kB mlocked:0kB dirty:0kB writeback:0kB mapped:5892kB shmem:1294220kB slab_reclaimable:7144kB slab_unreclaimable:5108kB kernel_stack:216kB pagetables:8616kB unstable:0kB bounce:0kB writeback_tmp:0kB pages_scanned:715 all_unreclaimable? yes
[ 1521.353576] lowmem_reserve[]: 0 0 4778 4778
[ 1521.353582] Normal free:6764kB min:6860kB low:8572kB high:10288kB active_anon:3643324kB inactive_anon:967724kB active_file:544kB inactive_file:844kB unevictable:68kB isolated(anon):0kB isolated(file):0kB present:4892832kB mlocked:68kB dirty:0kB writeback:0kB mapped:20832kB shmem:2435096kB slab_reclaimable:52564kB slab_unreclaimable:79484kB kernel_stack:2968kB pagetables:34856kB unstable:0kB bounce:0kB writeback_tmp:0kB pages_scanned:2484 all_unreclaimable? yes
[ 1521.353583] lowmem_reserve[]: 0 0 0 0
[ 1521.353586] DMA: 1*4kB 0*8kB 1*16kB 0*32kB 2*64kB 1*128kB 1*256kB 0*512kB 1*1024kB 1*2048kB 3*4096kB = 15892kB
[ 1521.353592] DMA32: 740*4kB 506*8kB 300*16kB 135*32kB 25*64kB 0*128kB 0*256kB 0*512kB 0*1024kB 1*2048kB 1*4096kB = 23872kB
[ 1521.353599] Normal: 637*4kB 0*8kB 0*16kB 2*32kB 1*64kB 0*128kB 1*256kB 1*512kB 1*1024kB 1*2048kB 0*4096kB = 6516kB
[ 1521.353605] 932908 total pagecache pages
[ 1521.353606] 0 pages in swap cache
[ 1521.353607] Swap cache stats: add 0, delete 0, find 0/0
[ 1521.353608] Free swap = 0kB
[ 1521.353609] Total swap = 0kB
[ 1521.369740] 2094576 pages RAM
[ 1521.369743] 80362 pages reserved
[ 1521.369744] 36619 pages shared
[ 1521.369745] 1993098 pages non-shared
[ 1521.369746] [ pid ] uid tgid total_vm rss nr_ptes swapents oom_score_adj name
[ 1521.369752] [ 2286] 0 2286 6258 269 16 0 -1000 systemd-udevd
[ 1521.369754] [ 2293] 0 2293 153174 83 229 0 0 systemd-journal
[ 1521.369757] [ 3585] 0 3585 4695 188 13 0 0 mount.ntfs-3g
[ 1521.369759] [ 3615] 0 3615 3547 140 12 0 0 crond
[ 1521.369761] [ 3616] 0 3616 6708 2523 18 0 0 preload
[ 1521.369763] [ 3617] 0 3617 17762 297 38 0 0 cupsd
[ 1521.369765] [ 3619] 0 3619 43562 313 52 0 0 NetworkManager
[ 1521.369767] [ 3620] 84 3620 6988 70 20 0 0 avahi-daemon
[ 1521.369769] [ 3621] 0 3621 6515 72 18 0 0 systemd-logind
[ 1521.369770] [ 3622] 81 3622 4595 285 14 0 -900 dbus-daemon
[ 1521.369772] [ 3626] 0 3626 2275 32 9 0 0 agetty
[ 1521.369774] [ 3627] 0 3627 6693 53 19 0 0 kdm
[ 1521.369776] [ 3628] 84 3628 6957 52 18 0 0 avahi-daemon
[ 1521.369778] [ 3631] 0 3631 45316 12716 91 0 0 X
[ 1521.369780] [ 4287] 0 4287 15666 128 36 0 0 kdm
[ 1521.369782] [ 5131] 102 5131 92417 912 41 0 0 polkitd
[ 1521.369784] [ 5132] 0 5132 53222 346 41 0 0 colord
[ 1521.369786] [ 5163] 0 5163 129753 991 153 0 0 colord-sane
[ 1521.369788] [11395] 0 11395 523912 258 62 0 0 console-kit-dae
[ 1521.369790] [11468] 1000 11468 3668 111 13 0 0 startkde
[ 1521.369792] [11480] 1000 11480 3970 37 13 0 0 dbus-launch
[ 1521.369794] [11481] 1000 11481 4839 401 15 0 0 dbus-daemon
[ 1521.369796] [11507] 1000 11507 4068 94 12 0 0 gpg-agent
[ 1521.369798] [11510] 1000 11510 3760 87 11 0 0 ssh-agent
[ 1521.369799] [11524] 1000 11524 1013 21 7 0 -300 start_kdeinit
[ 1521.369801] [11525] 1000 11525 85821 1591 149 0 -300 kdeinit4
[ 1521.369803] [11528] 1000 11528 188590 3072 227 0 0 kded4
[ 1521.369805] [11534] 1000 11534 108217 2084 173 0 0 kwalletd
[ 1521.369807] [11539] 1000 11539 107913 2348 173 0 0 kglobalaccel
[ 1521.369809] [11542] 0 11542 55597 601 43 0 0 upowerd
[ 1521.369811] [11555] 1000 11555 1047 18 7 0 0 kwrapper4
[ 1521.369813] [11556] 1000 11556 127307 2185 174 0 0 ksmserver
[ 1521.369814] [11568] 0 11568 49409 269 33 0 0 udisks-daemon
[ 1521.369816] [11573] 0 11573 12394 89 28 0 0 udisks-daemon
[ 1521.369818] [11577] 1000 11577 214097 12177 260 0 0 kwin
[ 1521.369820] [11590] 1000 11590 93530 1489 131 0 0 kactivitymanage
[ 1521.369822] [11621] 1000 11621 343123 3417 215 0 0 knotify4
[ 1521.369824] [11631] 1000 11631 175587 4370 239 0 0 krunner
[ 1521.369826] [11633] 1000 11633 246522 16714 342 0 0 plasma-desktop
[ 1521.369828] [11636] 1000 11636 216148 5325 253 0 0 lancelot
[ 1521.369830] [11639] 1000 11639 50634 268 35 0 0 mission-control
[ 1521.369831] [11643] 1000 11643 37597 405 39 0 0 akonadi_control
[ 1521.369833] [11645] 1000 11645 357276 722 81 0 0 akonadiserver
[ 1521.369835] [11652] 1000 11652 377776 6206 70 0 0 mysqld
[ 1521.369837] [11738] 1000 11738 76786 1061 110 0 0 akonadi_agent_l
[ 1521.369839] [11739] 1000 11739 76783 1056 111 0 0 akonadi_agent_l
[ 1521.369841] [11740] 1000 11740 75143 1033 111 0 0 akonadi_agent_l
[ 1521.369843] [11741] 1000 11741 75144 1042 110 0 0 akonadi_agent_l
[ 1521.369845] [11742] 1000 11742 75800 1048 112 0 0 akonadi_agent_l
[ 1521.369847] [11743] 1000 11743 75800 1054 107 0 0 akonadi_agent_l
[ 1521.369848] [11744] 1000 11744 76786 1064 108 0 0 akonadi_agent_l
[ 1521.369850] [11745] 1000 11745 76780 1073 111 0 0 akonadi_agent_l
[ 1521.369852] [11746] 1000 11746 84215 1305 155 0 0 akonadi_maildis
[ 1521.369854] [11747] 1000 11747 92098 1211 138 0 0 akonadi_nepomuk
[ 1521.369856] [11774] 1000 11774 59745 591 76 0 0 nepomukserver
[ 1521.369858] [11777] 1000 11777 287924 2235 149 0 0 nepomukservices
[ 1521.369860] [11795] 1000 11795 100823 10181 51 0 0 virtuoso-t
[ 1521.369861] [11801] 1000 11801 93041 786 99 0 0 pulseaudio
[ 1521.369863] [11802] 133 11802 41125 46 17 0 0 rtkit-daemon
[ 1521.369865] [11811] 1000 11811 17253 140 36 0 0 gconf-helper
[ 1521.369867] [11813] 1000 11813 11527 127 26 0 0 gconfd-2
[ 1521.369869] [11816] 1000 11816 68886 1148 123 0 0 kuiserver
[ 1521.369871] [11837] 1000 11837 58146 1047 105 0 0 nepomukservices
[ 1521.369873] [11839] 1000 11839 53655 966 98 0 0 nepomukservices
[ 1521.369875] [11840] 1000 11840 92263 1128 107 0 0 nepomukservices
[ 1521.369877] [11841] 1000 11841 109750 1232 107 0 0 nepomukservices
[ 1521.369878] [12942] 1000 12942 41975 542 78 0 0 kwrited
[ 1521.369880] [12944] 1000 12944 246808 6774 195 0 0 ktorrent
[ 1521.369882] [12954] 1000 12954 93430 1212 139 0 0 polkit-kde-auth
[ 1521.369884] [12957] 1000 12957 70673 1126 130 0 0 nepomukcontroll
[ 1521.369886] [12959] 1000 12959 92309 1654 138 0 0 kgpg
[ 1521.369888] [12966] 1000 12966 109879 2164 176 0 0 klipper
[ 1521.369890] [13009] 1000 13009 86477 1682 131 0 0 kio_http_cache_
[ 1521.369892] [17302] 1000 17302 270535 59165 488 0 0 firefox
[ 1521.369894] [17322] 1000 17322 10407 86 26 0 0 gvfsd
[ 1521.369896] [17324] 1000 17324 50365 171 31 0 0 gvfs-fuse-daemo
[ 1521.369897] [18462] 1000 18462 138761 5014 199 0 0 konsole
[ 1521.369899] [18464] 1000 18464 4227 156 13 0 0 bash
[ 1521.369901] [19535] 1000 19535 3885 324 13 0 0 yaourt
[ 1521.369903] [19680] 1000 19680 3800 253 13 0 0 makepkg
[ 1521.369905] [22861] 1000 22861 174765 6917 209 0 0 dolphin
[ 1521.369907] [24940] 1000 24940 12258 2121 27 0 0 Xvfb
[ 1521.369909] [24941] 1000 24941 2944 134 11 0 0 make
[ 1521.369911] [25116] 1000 25116 2946 137 11 0 0 make
[ 1521.369913] [25337] 1000 25337 3013 200 11 0 0 make
[ 1521.369915] [ 473] 1000 473 2977 169 12 0 0 make
[ 1521.369917] [ 3719] 1000 3719 3006 176 12 0 0 make
[ 1521.369919] [10784] 1000 10784 3006 175 13 0 0 make
[ 1521.369921] [12252] 1000 12252 115351 9567 175 0 0 kvirc
[ 1521.369922] [26014] 1000 26014 4256 168 13 0 0 bash
[ 1521.369925] [30177] 1000 30177 4255 167 14 0 0 bash
[ 1521.369926] [30976] 1000 30976 86977 3634 138 0 0 plugin-containe
[ 1521.369928] [ 915] 1000 915 87003 1648 132 0 0 kio_file
[ 1521.369930] [ 916] 1000 916 109277 2635 176 0 0 kio_thumbnail
[ 1521.369932] [ 1186] 1000 1186 4227 157 13 0 0 bash
[ 1521.369934] [ 2105] 1000 2105 86873 1689 132 0 0 klauncher
[ 1521.369936] [ 2473] 1000 2473 87003 1648 132 0 0 kio_file
[ 1521.369938] [ 3468] 1000 3468 141313 5962 206 0 0 kate
[ 1521.369940] [ 6331] 1000 6331 109512 2225 174 0 0 kate
[ 1521.369942] [ 6733] 1000 6733 2983 150 12 0 0 make
[ 1521.369943] [ 6760] 1000 6760 17243 1559 39 0 0 python
[ 1521.369945] [ 6761] 1000 6761 1882 30 9 0 0 c++
[ 1521.369947] [ 6762] 1000 6762 1816 23 9 0 0 collect2
[ 1521.369949] [ 6763] 1000 6763 812215 809141 1588 0 0 ld
[ 1521.369951] Out of memory: Kill process 6763 (ld) score 402 or sacrifice child
[ 1521.369953] Killed process 6763 (ld) total-vm:3248860kB, anon-rss:3236396kB, file-rss:168kB



gcc -v
Using built-in specs.
COLLECT_GCC=gcc
COLLECT_LTO_WRAPPER=/usr/lib/gcc/x86_64-unknown-linux-gnu/4.7.2/lto-wrapper
Target: x86_64-unknown-linux-gnu
Configured with: /build/src/gcc-4.7.2/configure --prefix=/usr --libdir=/usr/lib --libexecdir=/usr/lib --mandir=/usr/share/man --infodir=/usr/share/info --with-bugurl=https://bugs.archlinux.org/ --enable-languages=c,c++,ada,fortran,go,lto,objc,obj-c++ --enable-shared --enable-threads=posix --with-system-zlib --enable-__cxa_atexit --disable-libunwind-exceptions --enable-clocale=gnu --disable-libstdcxx-pch --enable-libstdcxx-time --enable-gnu-unique-object --enable-linker-build-id --with-ppl --enable-cloog-backend=isl --disable-ppl-version-check --disable-cloog-version-check --enable-lto --enable-gold --enable-ld=default --enable-plugin --with-plugin-ld=ld.gold --with-linker-hash-style=gnu --disable-multilib --disable-libssp --disable-build-with-cxx --disable-build-poststage1-with-cxx --enable-checking=release
Thread model: posix
gcc version 4.7.2 (GCC)

cat /proc/meminfo
MemTotal: 8056856 kB
MemFree: 1240336 kB
Buffers: 278356 kB
Cached: 4591784 kB
SwapCached: 0 kB
Active: 2700172 kB
Inactive: 3860720 kB
Active(anon): 2498432 kB
Inactive(anon): 2441488 kB
Active(file): 201740 kB
Inactive(file): 1419232 kB
Unevictable: 68 kB
Mlocked: 68 kB
SwapTotal: 0 kB
SwapFree: 0 kB
Dirty: 124 kB
Writeback: 0 kB
AnonPages: 1690996 kB
Mapped: 218032 kB
Shmem: 3249176 kB
Slab: 172972 kB
SReclaimable: 90332 kB
SUnreclaim: 82640 kB
KernelStack: 3264 kB
PageTables: 38384 kB
NFS_Unstable: 0 kB
Bounce: 0 kB
WritebackTmp: 0 kB
CommitLimit: 4028428 kB
Committed_AS: 6713700 kB
VmallocTotal: 34359738367 kB
VmallocUsed: 92972 kB
VmallocChunk: 34359642076 kB
HugePages_Total: 0
HugePages_Free: 0
HugePages_Rsvd: 0
HugePages_Surp: 0
Hugepagesize: 2048 kB
DirectMap4k: 10240 kB
DirectMap2M: 7237632 kB


/etc/makepkg.conf

#########################################################################
# ARCHITECTURE, COMPILE FLAGS
#########################################################################
#
CARCH="x86_64"
CHOST="x86_64-unknown-linux-gnu"
CFLAGS="-march=native -O2 -pipe -fstack-protector --param=ssp-buffer-size=4 -D_FORTIFY_SOURCE=2"
CXXFLAGS="${CFLAGS}"
LDFLAGS="-Wl,-O1,--sort-common,--as-needed,-z,relro"
MAKEFLAGS="-j5"
saludos, ad1
--Intel i5 3570k --Asrock z77 ext. 4 --Skill 2x4GB 1600 --Ati 5850 --HI/FI harman-kardon avr255 , Polk audio r40 & cs245i & Infinity beta sw10 --S.O Gentoo & Win 7 64bits --Eizo 19" & Panasonic viera 32 "

papu
Archer
Archer
Mensajes: 20
Registrado: 30 Oct 2011, 12:22

Re: error al compilar firefox...Out of memory: Kill process

Mensaje por papu » 13 Oct 2012, 13:24

perdón esto debería ir en crear paquetes pero bueno , si alguien lo cambia de lugar o da igual :)

ad1
--Intel i5 3570k --Asrock z77 ext. 4 --Skill 2x4GB 1600 --Ati 5850 --HI/FI harman-kardon avr255 , Polk audio r40 & cs245i & Infinity beta sw10 --S.O Gentoo & Win 7 64bits --Eizo 19" & Panasonic viera 32 "

Avatar de Usuario
Spooky
Equipo Hispano
Equipo Hispano
Mensajes: 1774
Registrado: 18 Nov 2010, 23:33
Ubicación: Behind your computer

Re: error al compilar firefox...Out of memory: Kill process

Mensaje por Spooky » 13 Oct 2012, 16:26

Por que estas compilando firefox?
Este se encuentra en los repos, puedes instalar con pacman -S.
Y que paquete estas compilando?

PD:Tema movido. :wink:

papu
Archer
Archer
Mensajes: 20
Registrado: 30 Oct 2011, 12:22

Re: error al compilar firefox...Out of memory: Kill process

Mensaje por papu » 13 Oct 2012, 18:50

pues porque me apetece compilarlo para probar rendimiento respecto al binario, y también porque llegue a archlinux desde gentoo y es complicado olvidar la costumbre jeje :) tendría que poder compilarse correctamente no se porque ocurre ese error me parece extraño que ya que como dije en gentoo con 4gb de ram no tenía problemas en compilar ningun tipo de paquetes con una cpu también inferior a la que tengo ahora ( algunos bastante mayores que firefox) y aqui con 8 gigas me da este error que me parece muy extraño, de otra forma no he hubiera dado más importancia la verdad :)

saludos, ad1
--Intel i5 3570k --Asrock z77 ext. 4 --Skill 2x4GB 1600 --Ati 5850 --HI/FI harman-kardon avr255 , Polk audio r40 & cs245i & Infinity beta sw10 --S.O Gentoo & Win 7 64bits --Eizo 19" & Panasonic viera 32 "

Avatar de Usuario
Spooky
Equipo Hispano
Equipo Hispano
Mensajes: 1774
Registrado: 18 Nov 2010, 23:33
Ubicación: Behind your computer

Re: error al compilar firefox...Out of memory: Kill process

Mensaje por Spooky » 13 Oct 2012, 22:39

Lo vuelvo a preguntar, que paquete estas intentando compilar?
En archlinux para poder compilar paquetes, necesitas instalar base-devel.
Sin ese paquete jamas podras compilar algo..

papu
Archer
Archer
Mensajes: 20
Registrado: 30 Oct 2011, 12:22

Re: error al compilar firefox...Out of memory: Kill process

Mensaje por papu » 13 Oct 2012, 22:55

el firefox, he compilado mas de 100 paketes hasta ahora solo me da problemas este :)
¿no sale el título del post? , disculpa no entiendo tu respuesta :)


gracias adéu. :oops:
--Intel i5 3570k --Asrock z77 ext. 4 --Skill 2x4GB 1600 --Ati 5850 --HI/FI harman-kardon avr255 , Polk audio r40 & cs245i & Infinity beta sw10 --S.O Gentoo & Win 7 64bits --Eizo 19" & Panasonic viera 32 "

Avatar de Usuario
Spooky
Equipo Hispano
Equipo Hispano
Mensajes: 1774
Registrado: 18 Nov 2010, 23:33
Ubicación: Behind your computer

Re: error al compilar firefox...Out of memory: Kill process

Mensaje por Spooky » 13 Oct 2012, 23:16

Puedo ver el titulo del tema perfectamente :wink:
Pero aun no logro adivinar "que paquete/version" quieres compilar.
Al principio del post mencionaste yaourt y makepkg, por lo tanto:
1-Entraste a https://aur.archlinux.org/ , buscaste a firefox y te bajaste el tarball del paquete especifico.
2-Usaste yaourt directo para intentar compilar ese paquete especifico.

En el repo AUR hay varios paquetes de firefox:
https://aur.archlinux.org/packages.php? ... _Search=Go

No tengo la mas remota idea de cual bajaste o intentas compilar:
Puede ser firefox-aurora-fr 18.0a2-1, o firefox-beta-bin-es-es 14.0b8-1, firefox-git 20120811-1 ??.
Exactamente cual es el nombre del paquete que bajaste o que intenas compilar desde yaourt?

papu
Archer
Archer
Mensajes: 20
Registrado: 30 Oct 2011, 12:22

Re: error al compilar firefox...Out of memory: Kill process

Mensaje por papu » 13 Oct 2012, 23:32

Spooky escribió:Puedo ver el titulo del tema perfectamente :wink:
Pero aun no logro adivinar "que paquete/version" quieres compilar.
Al principio del post mencionaste yaourt y makepkg, por lo tanto:
1-Entraste a https://aur.archlinux.org/ , buscaste a firefox y te bajaste el tarball del paquete especifico.
2-Usaste yaourt directo para intentar compilar ese paquete especifico.

En el repo AUR hay varios paquetes de firefox:
https://aur.archlinux.org/packages.php? ... _Search=Go

No tengo la mas remota idea de cual bajaste o intentas compilar:
Puede ser firefox-aurora-fr 18.0a2-1, o firefox-beta-bin-es-es 14.0b8-1, firefox-git 20120811-1 ??.
Exactamente cual es el nombre del paquete que bajaste o que intenas compilar desde yaourt?
al principio del post digo
que pues eso llevo intentanco compilar el firefox tanto version 15 como la nueva...
entonces es la 15 y la nueva es la 16, no compilo otra pq seguramente pasaría lo mismo , y pues asi estoy :mrgreen:
--Intel i5 3570k --Asrock z77 ext. 4 --Skill 2x4GB 1600 --Ati 5850 --HI/FI harman-kardon avr255 , Polk audio r40 & cs245i & Infinity beta sw10 --S.O Gentoo & Win 7 64bits --Eizo 19" & Panasonic viera 32 "

Avatar de Usuario
Spooky
Equipo Hispano
Equipo Hispano
Mensajes: 1774
Registrado: 18 Nov 2010, 23:33
Ubicación: Behind your computer

Re: error al compilar firefox...Out of memory: Kill process

Mensaje por Spooky » 13 Oct 2012, 23:39

Ya basta, si estas bajando el paquete de AUR, puedes compartir el link por favor?

Avatar de Usuario
Jristz
Archer Extremo
Archer Extremo
Mensajes: 745
Registrado: 14 Mar 2011, 20:20

Re: error al compilar firefox...Out of memory: Kill process

Mensaje por Jristz » 14 Oct 2012, 00:14

OUT OF MEMORY
falta de RAM, firefox requiere 6-8GB de RAM, o agregar -ftlo a los gcc-flags para bajarlo a 4-6GB de RAM
System: Host: Netbook Kernel: 4.4.39-1-lts x86_64 (64 bit) Desktop: Xfce 4.12.3 Distro: Arch Linux
Machine: Device: laptop System: TOSHIBA product: Satellite C845D v: PSCB6P-002LM1
Mobo: AMD model: Renmore UEFI: Insyde v: 6.10 date: 09/14/2012
Battery[/b] BAT1: charge: 5.3 Wh 17.5% condition: 30.4/44.0 Wh (69%)
CPU: Dual core AMD E-300 APU with Radeon HD Graphics (-MCP-) speed: 1300 MHz (max)
Graphics: Card: Advanced Micro Devices [AMD/ATI] Wrestler [Radeon HD 6310]

Avatar de Usuario
cargoan
Archer Confiable
Archer Confiable
Mensajes: 605
Registrado: 13 Mar 2011, 04:39

Re: error al compilar firefox...Out of memory: Kill process

Mensaje por cargoan » 29 Oct 2012, 03:44

Tienes la swap desactivada.
...
cat /proc/meminfo
MemTotal: 8056856 kB
MemFree: 1240336 kB
...
SwapTotal: 0 kB
SwapFree: 0 kB

...
«La simplicidad es la máxima sofisticación» (Leonardo da Vinci)

papu
Archer
Archer
Mensajes: 20
Registrado: 30 Oct 2011, 12:22

Re: error al compilar firefox...Out of memory: Kill process

Mensaje por papu » 29 Oct 2012, 06:51

muchas gracias por vuestras respuestas, he decidido volver a gentoo donde no tengo este tipo de problemas.


saludos, ad1 :mrgreen:
--Intel i5 3570k --Asrock z77 ext. 4 --Skill 2x4GB 1600 --Ati 5850 --HI/FI harman-kardon avr255 , Polk audio r40 & cs245i & Infinity beta sw10 --S.O Gentoo & Win 7 64bits --Eizo 19" & Panasonic viera 32 "

Avatar de Usuario
nicros
Equipo Hispano
Equipo Hispano
Mensajes: 815
Registrado: 23 Ago 2006, 10:37
Ubicación: Santiago, Chile

Re: error al compilar firefox...Out of memory: Kill process

Mensaje por nicros » 28 Dic 2012, 16:21

:shock: cerrado.
Por un foro mas ordenado:
Tema: Problema/Consulta [Solucionado]
Reglas del Foro

Cerrado